{"text_format":"1","workbook":"xlsx","n_sheets":9,"sheets":["Functions","Absorbance","Absorbance Data","Emission","Emission Data","Time","Globals","OOIDRV","bandedge"],"not_rendered":{"charts":20,"images":0,"macros":1,"external_links":0,"defined_names":3,"comments":0,"pivot_tables":0},"unopened":[{"sheet":"Functions","index":0,"reason":"part_missing"},{"sheet":"Globals","index":6,"reason":"part_missing"},{"sheet":"OOIDRV","index":7,"reason":"part_missing"}],"bounds":{"document_bytes":16777216,"sheet_cells":100000,"rows_first":2000,"rows_last":500,"rows_between":2000,"halvings":0,"cell_chars":16384,"cell_head_chars":4096},"cells_cut":0,"cells_raw":0,"read":"whole","date_system":"1900"}

{"sheet":"Absorbance","index":1,"n_rows":14,"n_cols":22,"rows_kept":14,"cut":false,"hidden":false,"merged":[]}
["Chosen wavelength",null,400,null,{"$f":"'Absorbance Data'!D6","v":"USB2E1203"},null,null,null,null,null,null,null,null,null,null,null,null,null,null,null,"Samples recorded at"]
["Sample","Conc","% T","Abs",null,null,null,null,null,null,null,null,null,null,null,null,null,null,null,null,"Clock","Seconds"]
[1,null,23.240688101502439,0.63375101766460251,null,null,null,null,null,null,null,null,null,null,null,null,null,null,null,null,"11:34:48",41688.15234375]
[2,null,12.812693309721695,0.89235956919337156,null,null,null,null,null,null,null,null,null,null,null,null,null,null,null,null,"11:33:30",41610.71875]
[]
[]
[]
[]
[]
[]
[]
[null,null,null,null,null,null,null,null,null,null,null,1]
[null,null,null,null,null,null,null,null,null,null,null,null,null,null,{"$f":"C1","v":400},{"$f":"'Absorbance Data'!I8","v":0.91107059630572296}]
[null,null,null,null,null,null,null,null,null,null,null,null,null,null,{"$f":"C1","v":400},{"$f":"'Absorbance Data'!I9","v":9.5970077103305101E-2}]

{"sheet":"Absorbance Data","index":2,"n_rows":4111,"n_cols":13,"rows_kept":4111,"cut":false,"hidden":false,"merged":[]}
[null,null,"Integration Time/ADC Rate",10,"<<-- Integration time in msec (normally 10)"]
[null,null,"Samples to Average",10,"<<-- Number of spectra to average (normally 10)"]
[null,null,"Boxcar Width",1,"<<-- Boxcar smoothing width in pixels (normally 1)"]
[null,null,"Channel Number",0,"<<-- 0=Master, 1=Slave1, 2=Slave2, 3=Slave3 (normally 0)"]
[null,null,"DelayTime",10,"<<-- Seconds for light to warm up during blank measurment (normally 10)"]
[null,null,"USB Serial Number","USB2E1203",null,null,"Next Spectrum",null,3]
[null,null,"First Wavelength Coefficient",0.36415669322013855,null,null,"Time Stamp",null,"Blank Recorded at 3/19/2020 11:30:19 AM"]
[null,null,"Second Wavelength Coefficient",-1.3657599993166514E-5,null,null,"Max Absorbance",null,{"$f":"MAX(E2650:CW4109)","v":0.91107059630572296},null,"Multiple Samples",null,2]
[null,null,"Third Wavelength Coefficient",-1.9412400575902211E-9,null,null,"Min Absorbance",null,{"$f":"MIN(E2650:CW4109)","v":9.5970077103305101E-2},null,"Delay time (seconds)",null,1]
[null,null,"Wavelength Intercept",189.37870788574219,"Spectra 1","Spectra 2"]
["D","R","Pixel #","l (nm)","Transmitance","Transmitance"]
[0,0,0,189.37870788574219,0,0]
[112.98000335693359,112.54000091552734,1,189.74284362792969,1699.9913302815924,1745.4449299486753]
[114.25,113.97000122070312,2,190.10696411132812,2589.2970027247957,2875.0136239782018]
[115.33999633789062,115,3,190.47105407714844,2011.7852975495916,2600.0269275648507]
{"$rows_left_out":4097}
{"sheet":"Emission","index":3,"n_rows":13,"n_cols":22,"rows_kept":13,"cut":false,"hidden":false,"merged":[]}
["Chosen wavelength",null,300,null,{"$f":"'Emission Data'!D6","v":"USB2000"},null,null,null,null,null,"Trigger level",null,null,null,null,null,null,null,null,null,"Samples recorded at"]
["Sample","Intensity","Peak","Intensity",null,null,null,null,null,null,1000,null,null,null,null,null,null,null,null,null,"Clock","Seconds"]
[null,null,null,null,null,null,null,null,null,null,"Press ESC or"]
[null,null,null,null,null,null,null,null,null,null,"set value for"]
[null,null,null,null,null,null,null,null,null,null," sample capture"]
[]
[]
[]
[]
[]
[]
[null,null,null,null,null,null,{"$f":"C1","v":300},{"$f":"'Emission Data'!I8","v":0}]
[null,null,null,null,null,null,{"$f":"C1","v":300},{"$f":"'Emission Data'!I9","v":0}]

{"sheet":"Emission Data","index":4,"n_rows":11,"n_cols":13,"rows_kept":11,"cut":false,"hidden":false,"merged":[]}
[null,null,"Integration Time/ADC Rate",10,"<<-- Integration time in msec (normally 10)"]
[null,null,"Samples to Average",1,"<<-- Number of spectra to average (normally 1)"]
[null,null,"Boxcar Width",1,"<<-- Boxcar smoothing width in pixels (normally 1)"]
[null,null,"Channel Number",0,"<<-- 0=Master, 1=Slave1, 2=Slave2, 3=Slave3, 4=Slave4, 5=Slave5, 6=Slave6, 7=Slave7 (normally 0)"]
[null,null,"Get the USB Coeficients",1,"<<-- 1=True, 0=False (Do this if spectrometer is changed)"]
[null,null,"USB Serial Number","USB2000",null,null,"Next Spectrum",null,1]
[null,null,"First Wavelength Coefficient",0.3573606014251709,null,null,"Time Stamp",null,"Blank not measured"]
[null,null,"Second Wavelength Coefficient",-9.4459701358573511E-6,null,null,"Max Intensity",null,{"$f":"MAX(D12:BG2059)","v":0},null,"Multiple Samples",null,2]
[null,null,"Third Wavelength Coefficient",-2.7281399361811509E-9,null,null,"Min Intensity",null,{"$f":"MIN(D12:BG2059)","v":0},null,"Delay time (seconds)",null,1]
[null,null,"Wavelength Intercept",190.33358764648437,null,null,"Trigger Level",null,1000]
[null,"Pixel #","l (nm)"]

{"sheet":"Time","index":5,"n_rows":5,"n_cols":16,"rows_kept":5,"cut":false,"hidden":false,"merged":[]}
["Sample","Seconds","%T(400)","%T(600)","%T(700)",{"$f":"'Absorbance Data'!D6","v":"USB2E1203"},null,null,null,null,"Wavelength 1",null,400,null,null,"This sheet only records selected"]
[null,null,null,null,null,null,null,null,null,null,"Wavelength 2",null,600,null,null,"wavelengths and not full spectrum"]
[null,null,null,null,null,null,null,null,null,null,"Wavelength 3",null,700,null,null,"so data can be collected faster."]
[null,null,null,null,null,null,"Be sure to record blank spectrum",null,null,null,"Number of Samples",null,20]
[null,null,null,null,null,null,"on the Absorbance sheet first!",null,null,null,"Delay time (seconds)",null,0]

{"sheet":"bandedge","index":8,"n_rows":23,"n_cols":21,"rows_kept":23,"cut":false,"hidden":false,"merged":[]}
["Sample","start1","stop1","start2","stop2","intersection","slope1","intercept1","slope2","intercept2","Dataset",{"$f":"\"index_\"&B1","v":"index_start1"},{"$f":"\"index_\"&C1","v":"index_stop1"},{"$f":"\"index_\"&D1","v":"index_start2"},{"$f":"\"index_\"&E1","v":"index_stop2"},{"$f":"\"y_\"&B1","v":"y_start1"},{"$f":"\"y_\"&C1","v":"y_stop1"},"y_start2","y_stop2","y_stop_extend"]
[1,410,430,550,700,{"$f":"(J2-H2)/(G2-I2)","v":456.54095078352128},{"$f":"SLOPE(INDIRECT(\"'Absorbance Data'!\"&bandedge!K2&bandedge!L2&\":\"&bandedge!K2&bandedge!M2),INDIRECT(\"'Absorbance Data'!D\"&bandedge!L2&\":D\"&bandedge!M2))","v":-4.658764180712211E-3},{"$f":"INTERCEPT(INDIRECT(\"'Absorbance Data'!\"&bandedge!K2&bandedge!L2&\":\"&bandedge!K2&bandedge!M2),INDIRECT(\"'Absorbance Data'!D\"&bandedge!L2&\":D\"&bandedge!M2))","v":2.4989690940763931},{"$f":"SLOPE(INDIRECT(\"'Absorbance Data'!\"&bandedge!K2&bandedge!N2&\":\"&bandedge!K2&bandedge!O2),INDIRECT(\"'Absorbance Data'!D\"&bandedge!N2&\":D\"&bandedge!O2))","v":-6.149781818204688E-4},{"$f":"INTERCEPT(INDIRECT(\"'Absorbance Data'!\"&bandedge!K2&bandedge!N2&\":\"&bandedge!K2&bandedge!O2),INDIRECT(\"'Absorbance Data'!D\"&bandedge!N2&\":D\"&bandedge!O2))","v":0.65281518937726579},"E",{"$f":"2063+MATCH(B2,'Absorbance Data'!$D$2063:$D$4109)","v":2684},{"$f":"2063+MATCH(C2,'Absorbance Data'!$D$2063:$D$4109)","v":2742},{"$f":"2063+MATCH(D2,'Absorbance Data'!$D$2063:$D$4109)","v":3099},{"$f":"2063+MATCH(E2,'Absorbance Data'!$D$2063:$D$4109)","v":3568},{"$f":"G2*B2+H2","v":0.58887577998438667},{"$f":"G2*C2+H2","v":0.49570049637014257},{"$f":"I2*D2+J2","v":0.31457718937600793},{"$f":"I2*E2+J2","v":0.22233046210293761},{"$f":"G2*F2+H2","v":0.37205246553782789},{"$f":"\"sample \"&CODE(K2)-68","v":"sample 1"}]
[2,420,450,560,700,418.88183402649446,{"$f":"SLOPE(INDIRECT(\"'Absorbance Data'!\"&bandedge!K3&bandedge!L3&\":\"&bandedge!K3&bandedge!M3),INDIRECT(\"'Absorbance Data'!D\"&bandedge!L3&\":D\"&bandedge!M3))","v":-4.6369348560322925E-3},{"$f":"INTERCEPT(INDIRECT(\"'Absorbance Data'!\"&bandedge!K3&bandedge!L3&\":\"&bandedge!K3&bandedge!M3),INDIRECT(\"'Absorbance Data'!D\"&bandedge!L3&\":D\"&bandedge!M3))","v":2.6944311830210137},{"$f":"SLOPE(INDIRECT(\"'Absorbance Data'!\"&bandedge!K3&bandedge!N3&\":\"&bandedge!K3&bandedge!O3),INDIRECT(\"'Absorbance Data'!D\"&bandedge!N3&\":D\"&bandedge!O3))","v":-1.2986151446464876E-3},{"$f":"INTERCEPT(INDIRECT(\"'Absorbance Data'!\"&bandedge!K3&bandedge!N3&\":\"&bandedge!K3&bandedge!O3),INDIRECT(\"'Absorbance Data'!D\"&bandedge!N3&\":D\"&bandedge!O3))","v":1.2960696997489303},"F",{"$f":"2063+MATCH(B3,'Absorbance Data'!$D$2063:$D$4109)","v":2713},{"$f":"2063+MATCH(C3,'Absorbance Data'!$D$2063:$D$4109)","v":2801},{"$f":"2063+MATCH(D3,'Absorbance Data'!$D$2063:$D$4109)","v":3129},{"$f":"2063+MATCH(E3,'Absorbance Data'!$D$2063:$D$4109)","v":3568},{"$f":"G3*B3+H3","v":0.74691854348745079},{"$f":"G3*C3+H3","v":0.607810497806482},{"$f":"I3*D3+J3","v":0.5688452187468972},{"$f":"I3*E3+J3","v":0.38703909849638896},0.75210340626482797,{"$f":"\"sample \"&CODE(K3)-68","v":"sample 2"}]
[3,430,460,570,700,{"$error":"#DIV/0!"},{"$f":"SLOPE(INDIRECT(\"'Absorbance Data'!\"&bandedge!K4&bandedge!L4&\":\"&bandedge!K4&bandedge!M4),INDIRECT(\"'Absorbance Data'!D\"&bandedge!L4&\":D\"&bandedge!M4))","v":{"$error":"#DIV/0!"}},{"$f":"INTERCEPT(INDIRECT(\"'Absorbance Data'!\"&bandedge!K4&bandedge!L4&\":\"&bandedge!K4&bandedge!M4),INDIRECT(\"'Absorbance Data'!D\"&bandedge!L4&\":D\"&bandedge!M4))","v":{"$error":"#DIV/0!"}},{"$f":"SLOPE(INDIRECT(\"'Absorbance Data'!\"&bandedge!K4&bandedge!N4&\":\"&bandedge!K4&bandedge!O4),INDIRECT(\"'Absorbance Data'!D\"&bandedge!N4&\":D\"&bandedge!O4))","v":{"$error":"#DIV/0!"}},{"$f":"INTERCEPT(INDIRECT(\"'Absorbance Data'!\"&bandedge!K4&bandedge!N4&\":\"&bandedge!K4&bandedge!O4),INDIRECT(\"'Absorbance Data'!D\"&bandedge!N4&\":D\"&bandedge!O4))","v":{"$error":"#DIV/0!"}},"G",{"$f":"2063+MATCH(B4,'Absorbance Data'!$D$2063:$D$4109)","v":2742},{"$f":"2063+MATCH(C4,'Absorbance Data'!$D$2063:$D$4109)","v":2830},{"$f":"2063+MATCH(D4,'Absorbance Data'!$D$2063:$D$4109)","v":3160},{"$f":"2063+MATCH(E4,'Absorbance Data'!$D$2063:$D$4109)","v":3568},{"$error":"#DIV/0!"},{"$error":"#DIV/0!"},{"$error":"#DIV/0!"},{"$error":"#DIV/0!"},{"$error":"#DIV/0!"},"sample 3"]
[4,450,470,580,700,{"$error":"#DIV/0!"},{"$f":"SLOPE(INDIRECT(\"'Absorbance Data'!\"&bandedge!K5&bandedge!L5&\":\"&bandedge!K5&bandedge!M5),INDIRECT(\"'Absorbance Data'!D\"&bandedge!L5&\":D\"&bandedge!M5))","v":{"$error":"#DIV/0!"}},{"$f":"INTERCEPT(INDIRECT(\"'Absorbance Data'!\"&bandedge!K5&bandedge!L5&\":\"&bandedge!K5&bandedge!M5),INDIRECT(\"'Absorbance Data'!D\"&bandedge!L5&\":D\"&bandedge!M5))","v":{"$error":"#DIV/0!"}},{"$f":"SLOPE(INDIRECT(\"'Absorbance Data'!\"&bandedge!K5&bandedge!N5&\":\"&bandedge!K5&bandedge!O5),INDIRECT(\"'Absorbance Data'!D\"&bandedge!N5&\":D\"&bandedge!O5))","v":{"$error":"#DIV/0!"}},{"$f":"INTERCEPT(INDIRECT(\"'Absorbance Data'!\"&bandedge!K5&bandedge!N5&\":\"&bandedge!K5&bandedge!O5),INDIRECT(\"'Absorbance Data'!D\"&bandedge!N5&\":D\"&bandedge!O5))","v":{"$error":"#DIV/0!"}},"H",{"$f":"2063+MATCH(B5,'Absorbance Data'!$D$2063:$D$4109)","v":2801},{"$f":"2063+MATCH(C5,'Absorbance Data'!$D$2063:$D$4109)","v":2860},{"$f":"2063+MATCH(D5,'Absorbance Data'!$D$2063:$D$4109)","v":3191},{"$f":"2063+MATCH(E5,'Absorbance Data'!$D$2063:$D$4109)","v":3568},{"$f":"G5*B5+H5","v":{"$error":"#DIV/0!"}},{"$f":"G5*C5+H5","v":{"$error":"#DIV/0!"}},{"$f":"I5*D5+J5","v":{"$error":"#DIV/0!"}},{"$f":"I5*E5+J5","v":{"$error":"#DIV/0!"}},{"$error":"#DIV/0!"},{"$f":"\"sample \"&CODE(K5)-68","v":"sample 4"}]
[5,470,500,590,700,{"$error":"#DIV/0!"},{"$f":"SLOPE(INDIRECT(\"'Absorbance Data'!\"&bandedge!K6&bandedge!L6&\":\"&bandedge!K6&bandedge!M6),INDIRECT(\"'Absorbance Data'!D\"&bandedge!L6&\":D\"&bandedge!M6))","v":{"$error":"#DIV/0!"}},{"$f":"INTERCEPT(INDIRECT(\"'Absorbance Data'!\"&bandedge!K6&bandedge!L6&\":\"&bandedge!K6&bandedge!M6),INDIRECT(\"'Absorbance Data'!D\"&bandedge!L6&\":D\"&bandedge!M6))","v":{"$error":"#DIV/0!"}},{"$f":"SLOPE(INDIRECT(\"'Absorbance Data'!\"&bandedge!K6&bandedge!N6&\":\"&bandedge!K6&bandedge!O6),INDIRECT(\"'Absorbance Data'!D\"&bandedge!N6&\":D\"&bandedge!O6))","v":{"$error":"#DIV/0!"}},{"$f":"INTERCEPT(INDIRECT(\"'Absorbance Data'!\"&bandedge!K6&bandedge!N6&\":\"&bandedge!K6&bandedge!O6),INDIRECT(\"'Absorbance Data'!D\"&bandedge!N6&\":D\"&bandedge!O6))","v":{"$error":"#DIV/0!"}},"I",{"$f":"2063+MATCH(B6,'Absorbance Data'!$D$2063:$D$4109)","v":2860},{"$f":"2063+MATCH(C6,'Absorbance Data'!$D$2063:$D$4109)","v":2949},{"$f":"2063+MATCH(D6,'Absorbance Data'!$D$2063:$D$4109)","v":3221},{"$f":"2063+MATCH(E6,'Absorbance Data'!$D$2063:$D$4109)","v":3568},{"$error":"#DIV/0!"},{"$error":"#DIV/0!"},{"$error":"#DIV/0!"},{"$error":"#DIV/0!"},{"$error":"#DIV/0!"},"sample 5"]
[6,470,500,570,700,{"$error":"#DIV/0!"},{"$f":"SLOPE(INDIRECT(\"'Absorbance Data'!\"&bandedge!K7&bandedge!L7&\":\"&bandedge!K7&bandedge!M7),INDIRECT(\"'Absorbance Data'!D\"&bandedge!L7&\":D\"&bandedge!M7))","v":{"$error":"#DIV/0!"}},{"$f":"INTERCEPT(INDIRECT(\"'Absorbance Data'!\"&bandedge!K7&bandedge!L7&\":\"&bandedge!K7&bandedge!M7),INDIRECT(\"'Absorbance Data'!D\"&bandedge!L7&\":D\"&bandedge!M7))","v":{"$error":"#DIV/0!"}},{"$f":"SLOPE(INDIRECT(\"'Absorbance Data'!\"&bandedge!K7&bandedge!N7&\":\"&bandedge!K7&bandedge!O7),INDIRECT(\"'Absorbance Data'!D\"&bandedge!N7&\":D\"&bandedge!O7))","v":{"$error":"#DIV/0!"}},{"$f":"INTERCEPT(INDIRECT(\"'Absorbance Data'!\"&bandedge!K7&bandedge!N7&\":\"&bandedge!K7&bandedge!O7),INDIRECT(\"'Absorbance Data'!D\"&bandedge!N7&\":D\"&bandedge!O7))","v":{"$error":"#DIV/0!"}},"J",{"$f":"2063+MATCH(B7,'Absorbance Data'!$D$2063:$D$4109)","v":2860},{"$f":"2063+MATCH(C7,'Absorbance Data'!$D$2063:$D$4109)","v":2949},{"$f":"2063+MATCH(D7,'Absorbance Data'!$D$2063:$D$4109)","v":3160},{"$f":"2063+MATCH(E7,'Absorbance Data'!$D$2063:$D$4109)","v":3568},{"$error":"#DIV/0!"},{"$error":"#DIV/0!"},{"$error":"#DIV/0!"},{"$error":"#DIV/0!"},{"$error":"#DIV/0!"},"sample 6"]
[7,500,530,650,750,{"$error":"#DIV/0!"},{"$f":"SLOPE(INDIRECT(\"'Absorbance Data'!\"&bandedge!K8&bandedge!L8&\":\"&bandedge!K8&bandedge!M8),INDIRECT(\"'Absorbance Data'!D\"&bandedge!L8&\":D\"&bandedge!M8))","v":{"$error":"#DIV/0!"}},{"$f":"INTERCEPT(INDIRECT(\"'Absorbance Data'!\"&bandedge!K8&bandedge!L8&\":\"&bandedge!K8&bandedge!M8),INDIRECT(\"'Absorbance Data'!D\"&bandedge!L8&\":D\"&bandedge!M8))","v":{"$error":"#DIV/0!"}},{"$f":"SLOPE(INDIRECT(\"'Absorbance Data'!\"&bandedge!K8&bandedge!N8&\":\"&bandedge!K8&bandedge!O8),INDIRECT(\"'Absorbance Data'!D\"&bandedge!N8&\":D\"&bandedge!O8))","v":{"$error":"#DIV/0!"}},{"$f":"INTERCEPT(INDIRECT(\"'Absorbance Data'!\"&bandedge!K8&bandedge!N8&\":\"&bandedge!K8&bandedge!O8),INDIRECT(\"'Absorbance Data'!D\"&bandedge!N8&\":D\"&bandedge!O8))","v":{"$error":"#DIV/0!"}},"K",{"$f":"2063+MATCH(B8,'Absorbance Data'!$D$2063:$D$4109)","v":2949},{"$f":"2063+MATCH(C8,'Absorbance Data'!$D$2063:$D$4109)","v":3039},{"$f":"2063+MATCH(D8,'Absorbance Data'!$D$2063:$D$4109)","v":3408},{"$f":"2063+MATCH(E8,'Absorbance Data'!$D$2063:$D$4109)","v":3731},{"$error":"#DIV/0!"},{"$error":"#DIV/0!"},{"$error":"#DIV/0!"},{"$error":"#DIV/0!"},{"$error":"#DIV/0!"},"sample 7"]
[8,560,590,690,775,{"$error":"#DIV/0!"},{"$f":"SLOPE(INDIRECT(\"'Absorbance Data'!\"&bandedge!K9&bandedge!L9&\":\"&bandedge!K9&bandedge!M9),INDIRECT(\"'Absorbance Data'!D\"&bandedge!L9&\":D\"&bandedge!M9))","v":{"$error":"#DIV/0!"}},{"$f":"INTERCEPT(INDIRECT(\"'Absorbance Data'!\"&bandedge!K9&bandedge!L9&\":\"&bandedge!K9&bandedge!M9),INDIRECT(\"'Absorbance Data'!D\"&bandedge!L9&\":D\"&bandedge!M9))","v":{"$error":"#DIV/0!"}},{"$f":"SLOPE(INDIRECT(\"'Absorbance Data'!\"&bandedge!K9&bandedge!N9&\":\"&bandedge!K9&bandedge!O9),INDIRECT(\"'Absorbance Data'!D\"&bandedge!N9&\":D\"&bandedge!O9))","v":{"$error":"#DIV/0!"}},{"$f":"INTERCEPT(INDIRECT(\"'Absorbance Data'!\"&bandedge!K9&bandedge!N9&\":\"&bandedge!K9&bandedge!O9),INDIRECT(\"'Absorbance Data'!D\"&bandedge!N9&\":D\"&bandedge!O9))","v":{"$error":"#DIV/0!"}},"L",{"$f":"2063+MATCH(B9,'Absorbance Data'!$D$2063:$D$4109)","v":3129},{"$f":"2063+MATCH(C9,'Absorbance Data'!$D$2063:$D$4109)","v":3221},{"$f":"2063+MATCH(D9,'Absorbance Data'!$D$2063:$D$4109)","v":3536},{"$f":"2063+MATCH(E9,'Absorbance Data'!$D$2063:$D$4109)","v":3814},{"$error":"#DIV/0!"},{"$error":"#DIV/0!"},{"$error":"#DIV/0!"},{"$error":"#DIV/0!"},{"$error":"#DIV/0!"},"sample 8"]
[9,610,630,740,775,{"$error":"#DIV/0!"},{"$f":"SLOPE(INDIRECT(\"'Absorbance Data'!\"&bandedge!K10&bandedge!L10&\":\"&bandedge!K10&bandedge!M10),INDIRECT(\"'Absorbance Data'!D\"&bandedge!L10&\":D\"&bandedge!M10))","v":{"$error":"#DIV/0!"}},{"$f":"INTERCEPT(INDIRECT(\"'Absorbance Data'!\"&bandedge!K10&bandedge!L10&\":\"&bandedge!K10&bandedge!M10),INDIRECT(\"'Absorbance Data'!D\"&bandedge!L10&\":D\"&bandedge!M10))","v":{"$error":"#DIV/0!"}},{"$f":"SLOPE(INDIRECT(\"'Absorbance Data'!\"&bandedge!K10&bandedge!N10&\":\"&bandedge!K10&bandedge!O10),INDIRECT(\"'Absorbance Data'!D\"&bandedge!N10&\":D\"&bandedge!O10))","v":{"$error":"#DIV/0!"}},{"$f":"INTERCEPT(INDIRECT(\"'Absorbance Data'!\"&bandedge!K10&bandedge!N10&\":\"&bandedge!K10&bandedge!O10),INDIRECT(\"'Absorbance Data'!D\"&bandedge!N10&\":D\"&bandedge!O10))","v":{"$error":"#DIV/0!"}},"M",{"$f":"2063+MATCH(B10,'Absorbance Data'!$D$2063:$D$4109)","v":3283},{"$f":"2063+MATCH(C10,'Absorbance Data'!$D$2063:$D$4109)","v":3345},{"$f":"2063+MATCH(D10,'Absorbance Data'!$D$2063:$D$4109)","v":3698},{"$f":"2063+MATCH(E10,'Absorbance Data'!$D$2063:$D$4109)","v":3814},{"$error":"#DIV/0!"},{"$error":"#DIV/0!"},{"$error":"#DIV/0!"},{"$error":"#DIV/0!"},{"$error":"#DIV/0!"},"sample 9"]
[10,null,null,null,null,{"$error":"#N/A"},{"$f":"SLOPE(INDIRECT(\"'Absorbance Data'!\"&bandedge!K11&bandedge!L11&\":\"&bandedge!K11&bandedge!M11),INDIRECT(\"'Absorbance Data'!D\"&bandedge!L11&\":D\"&bandedge!M11))","v":{"$error":"#N/A"}},{"$f":"INTERCEPT(INDIRECT(\"'Absorbance Data'!\"&bandedge!K11&bandedge!L11&\":\"&bandedge!K11&bandedge!M11),INDIRECT(\"'Absorbance Data'!D\"&bandedge!L11&\":D\"&bandedge!M11))","v":{"$error":"#N/A"}},{"$f":"SLOPE(INDIRECT(\"'Absorbance Data'!\"&bandedge!K11&bandedge!N11&\":\"&bandedge!K11&bandedge!O11),INDIRECT(\"'Absorbance Data'!D\"&bandedge!N11&\":D\"&bandedge!O11))","v":{"$error":"#N/A"}},{"$f":"INTERCEPT(INDIRECT(\"'Absorbance Data'!\"&bandedge!K11&bandedge!N11&\":\"&bandedge!K11&bandedge!O11),INDIRECT(\"'Absorbance Data'!D\"&bandedge!N11&\":D\"&bandedge!O11))","v":{"$error":"#N/A"}},"N",{"$f":"2063+MATCH(B11,'Absorbance Data'!$D$2063:$D$4109)","v":{"$error":"#N/A"}},{"$f":"2063+MATCH(C11,'Absorbance Data'!$D$2063:$D$4109)","v":{"$error":"#N/A"}},{"$f":"2063+MATCH(D11,'Absorbance Data'!$D$2063:$D$4109)","v":{"$error":"#N/A"}},{"$f":"2063+MATCH(E11,'Absorbance Data'!$D$2063:$D$4109)","v":{"$error":"#N/A"}},{"$error":"#N/A"},{"$error":"#N/A"},{"$error":"#N/A"},{"$error":"#N/A"},{"$error":"#N/A"},"sample 10"]
[11,null,null,null,null,{"$error":"#N/A"},{"$f":"SLOPE(INDIRECT(\"'Absorbance Data'!\"&bandedge!K12&bandedge!L12&\":\"&bandedge!K12&bandedge!M12),INDIRECT(\"'Absorbance Data'!D\"&bandedge!L12&\":D\"&bandedge!M12))","v":{"$error":"#N/A"}},{"$f":"INTERCEPT(INDIRECT(\"'Absorbance Data'!\"&bandedge!K12&bandedge!L12&\":\"&bandedge!K12&bandedge!M12),INDIRECT(\"'Absorbance Data'!D\"&bandedge!L12&\":D\"&bandedge!M12))","v":{"$error":"#N/A"}},{"$f":"SLOPE(INDIRECT(\"'Absorbance Data'!\"&bandedge!K12&bandedge!N12&\":\"&bandedge!K12&bandedge!O12),INDIRECT(\"'Absorbance Data'!D\"&bandedge!N12&\":D\"&bandedge!O12))","v":{"$error":"#N/A"}},{"$f":"INTERCEPT(INDIRECT(\"'Absorbance Data'!\"&bandedge!K12&bandedge!N12&\":\"&bandedge!K12&bandedge!O12),INDIRECT(\"'Absorbance Data'!D\"&bandedge!N12&\":D\"&bandedge!O12))","v":{"$error":"#N/A"}},"O",{"$f":"2063+MATCH(B12,'Absorbance Data'!$D$2063:$D$4109)","v":{"$error":"#N/A"}},{"$f":"2063+MATCH(C12,'Absorbance Data'!$D$2063:$D$4109)","v":{"$error":"#N/A"}},{"$f":"2063+MATCH(D12,'Absorbance Data'!$D$2063:$D$4109)","v":{"$error":"#N/A"}},{"$f":"2063+MATCH(E12,'Absorbance Data'!$D$2063:$D$4109)","v":{"$error":"#N/A"}},{"$error":"#N/A"},{"$error":"#N/A"},{"$error":"#N/A"},{"$error":"#N/A"},{"$error":"#N/A"},"sample 11"]
[12,null,null,null,null,{"$error":"#N/A"},{"$f":"SLOPE(INDIRECT(\"'Absorbance Data'!\"&bandedge!K13&bandedge!L13&\":\"&bandedge!K13&bandedge!M13),INDIRECT(\"'Absorbance Data'!D\"&bandedge!L13&\":D\"&bandedge!M13))","v":{"$error":"#N/A"}},{"$f":"INTERCEPT(INDIRECT(\"'Absorbance Data'!\"&bandedge!K13&bandedge!L13&\":\"&bandedge!K13&bandedge!M13),INDIRECT(\"'Absorbance Data'!D\"&bandedge!L13&\":D\"&bandedge!M13))","v":{"$error":"#N/A"}},{"$f":"SLOPE(INDIRECT(\"'Absorbance Data'!\"&bandedge!K13&bandedge!N13&\":\"&bandedge!K13&bandedge!O13),INDIRECT(\"'Absorbance Data'!D\"&bandedge!N13&\":D\"&bandedge!O13))","v":{"$error":"#N/A"}},{"$f":"INTERCEPT(INDIRECT(\"'Absorbance Data'!\"&bandedge!K13&bandedge!N13&\":\"&bandedge!K13&bandedge!O13),INDIRECT(\"'Absorbance Data'!D\"&bandedge!N13&\":D\"&bandedge!O13))","v":{"$error":"#N/A"}},"P",{"$f":"2063+MATCH(B13,'Absorbance Data'!$D$2063:$D$4109)","v":{"$error":"#N/A"}},{"$f":"2063+MATCH(C13,'Absorbance Data'!$D$2063:$D$4109)","v":{"$error":"#N/A"}},{"$f":"2063+MATCH(D13,'Absorbance Data'!$D$2063:$D$4109)","v":{"$error":"#N/A"}},{"$f":"2063+MATCH(E13,'Absorbance Data'!$D$2063:$D$4109)","v":{"$error":"#N/A"}},{"$error":"#N/A"},{"$error":"#N/A"},{"$error":"#N/A"},{"$error":"#N/A"},{"$error":"#N/A"},"sample 12"]
[null,null,null,null,null,{"$error":"#N/A"},{"$f":"SLOPE(INDIRECT(\"'Absorbance Data'!\"&bandedge!K14&bandedge!L14&\":\"&bandedge!K14&bandedge!M14),INDIRECT(\"'Absorbance Data'!D\"&bandedge!L14&\":D\"&bandedge!M14))","v":{"$error":"#N/A"}},{"$f":"INTERCEPT(INDIRECT(\"'Absorbance Data'!\"&bandedge!K14&bandedge!L14&\":\"&bandedge!K14&bandedge!M14),INDIRECT(\"'Absorbance Data'!D\"&bandedge!L14&\":D\"&bandedge!M14))","v":{"$error":"#N/A"}},{"$f":"SLOPE(INDIRECT(\"'Absorbance Data'!\"&bandedge!K14&bandedge!N14&\":\"&bandedge!K14&bandedge!O14),INDIRECT(\"'Absorbance Data'!D\"&bandedge!N14&\":D\"&bandedge!O14))","v":{"$error":"#N/A"}},{"$f":"INTERCEPT(INDIRECT(\"'Absorbance Data'!\"&bandedge!K14&bandedge!N14&\":\"&bandedge!K14&bandedge!O14),INDIRECT(\"'Absorbance Data'!D\"&bandedge!N14&\":D\"&bandedge!O14))","v":{"$error":"#N/A"}},"Q",{"$f":"2063+MATCH(B14,'Absorbance Data'!$D$2063:$D$4109)","v":{"$error":"#N/A"}},{"$f":"2063+MATCH(C14,'Absorbance Data'!$D$2063:$D$4109)","v":{"$error":"#N/A"}},{"$f":"2063+MATCH(D14,'Absorbance Data'!$D$2063:$D$4109)","v":{"$error":"#N/A"}},{"$f":"2063+MATCH(E14,'Absorbance Data'!$D$2063:$D$4109)","v":{"$error":"#N/A"}},{"$error":"#N/A"},{"$error":"#N/A"},{"$error":"#N/A"},{"$error":"#N/A"},{"$error":"#N/A"},"sample 13"]
[null,null,null,null,null,{"$error":"#N/A"},{"$f":"SLOPE(INDIRECT(\"'Absorbance Data'!\"&bandedge!K15&bandedge!L15&\":\"&bandedge!K15&bandedge!M15),INDIRECT(\"'Absorbance Data'!D\"&bandedge!L15&\":D\"&bandedge!M15))","v":{"$error":"#N/A"}},{"$f":"INTERCEPT(INDIRECT(\"'Absorbance Data'!\"&bandedge!K15&bandedge!L15&\":\"&bandedge!K15&bandedge!M15),INDIRECT(\"'Absorbance Data'!D\"&bandedge!L15&\":D\"&bandedge!M15))","v":{"$error":"#N/A"}},{"$f":"SLOPE(INDIRECT(\"'Absorbance Data'!\"&bandedge!K15&bandedge!N15&\":\"&bandedge!K15&bandedge!O15),INDIRECT(\"'Absorbance Data'!D\"&bandedge!N15&\":D\"&bandedge!O15))","v":{"$error":"#N/A"}},{"$f":"INTERCEPT(INDIRECT(\"'Absorbance Data'!\"&bandedge!K15&bandedge!N15&\":\"&bandedge!K15&bandedge!O15),INDIRECT(\"'Absorbance Data'!D\"&bandedge!N15&\":D\"&bandedge!O15))","v":{"$error":"#N/A"}},"R",{"$f":"2063+MATCH(B15,'Absorbance Data'!$D$2063:$D$4109)","v":{"$error":"#N/A"}},{"$f":"2063+MATCH(C15,'Absorbance Data'!$D$2063:$D$4109)","v":{"$error":"#N/A"}},{"$f":"2063+MATCH(D15,'Absorbance Data'!$D$2063:$D$4109)","v":{"$error":"#N/A"}},{"$f":"2063+MATCH(E15,'Absorbance Data'!$D$2063:$D$4109)","v":{"$error":"#N/A"}},{"$error":"#N/A"},{"$error":"#N/A"},{"$error":"#N/A"},{"$error":"#N/A"},{"$error":"#N/A"},"sample 14"]
{"$rows_left_out":8}